{"text_format":"1","workbook":"xlsx","n_sheets":7,"sheets":["Emissions Calculator","TACList","Emissions Output","Concentrations for Tier 3","Instructions for Conc. for T3","Revision History","Reference"],"not_rendered":{"charts":0,"images":1,"macros":1,"external_links":1,"defined_names":3,"comments":0,"pivot_tables":0},"unopened":[],"bounds":{"document_bytes":16777216,"sheet_cells":100000,"rows_first":2000,"rows_last":500,"rows_between":2000,"halvings":0,"cell_chars":16384,"cell_head_chars":4096},"cells_cut":0,"cells_raw":0,"read":"whole","date_system":"1900"}

{"sheet":"Emissions Calculator","index":0,"n_rows":290,"n_cols":29,"rows_kept":290,"cut":false,"hidden":false,"merged":[[237,8,239,8],[237,9,238,9],[237,11,238,11],[237,15,237,16],[237,0,239,0],[237,1,239,1],[237,2,238,2],[237,3,238,3],[237,7,239,7],[160,2,161,2],[160,3,161,3],[160,1,162,1],[160,0,162,0],[215,0,217,0],[215,1,217,1],[215,2,216,2],[215,3,216,3],[215,7,217,7],[215,8,217,8],[215,9,216,9],[215,11,216,11],[215,15,215,16],[160,15,160,16],[160,11,161,11],[160,9,161,9],[160,7,162,7],[160,8,162,8],[11,17,11,19],[30,14,30,15],[29,17,29,19],[128,4,128,5],[12,10,12,11],[12,12,12,13],[30,10,30,11],[30,12,30,13],[56,11,56,12],[56,13,56,14],[124,3,125,5],[56,15,56,16],[55,18,55,19],[90,18,90,19],[91,11,91,12],[91,13,91,14],[2,7,4,15],[12,14,12,15],[7,0,8,0],[130,1,131,1],[8,1,8,5],[13,8,14,8],[13,7,14,7],[31,7,32,7],[31,8,32,8],[57,7,58,7],[57,8,58,8],[92,8,93,8],[91,15,91,16],[136,7,137,7],[136,8,137,8],[135,14,135,15],[30,1,30,3],[132,0,133,5],[127,0,127,1],[127,2,127,3]]}
["TAC Emissions Calculator V3.02"]
["Equipment Details","Input","Units",null,null,null,null,"INSTRUCTIONS to Generate TAC Emissions To Upload Into HRA Tool"]
["Hours/Day",null,"hrs/day",null,null,null,null,"Purpose: This tool uses standard default emission factors and TAC speciations for standard types of equipment. If the equipment is not one of the listed source types, please enter the TACs and emission rates directly in the HRA Tool."]
["Days/Week",null,"days/wk"]
["Weeks/Year",null,"wks/yr"]
["Control Efficiency",null,"value between 0-1",null,null,null,null,"1. Select the Source Type in Cell B9. (This will generate related input data fields below.)"]
[null,null,null,null,null,null,null,"2. Input operating schedule, control efficiency, and required data for the selected source type. (Fields highlighted in light yellow.)"]
["Source Type",null,null,null,null,null,null,"3. Review \"Emissions Output\" sheet to verify TACs and emissions."]
[null,null,null,null,null,null,null,"4. Click Refresh button below, then save file for uploading into the HRA Tool."]
["Source Category on HRA Tool ->",{"$f":"IF(B9=\"Boiler\",\"Gaseous Fuel Fired (Natural Gas) Boilers\",IF(B9=\"Crematories\",\"Crematories\",IF(B9=\"Diesel ICE\",\"Diesel Reciprocating Internal Combustion Engines\",IF(B9=\"Diesel Pressure Washer\",\"Diesel Reciprocating Internal Combustion Engines\",IF(OR(B9=\"Lean Burn ICE\",B9=\"Rich Burn ICE\"),\"Natural Gas Reciprocating Internal Combustion Engines\",IF(B9=\"Spray Booth\",\"Spray Booth\",IF(B9=\"Other\",\"Please select the applicable equipment type on the HRA Tool.\",IF(B9=\"\",\"\",B9))))))))","v":""},null,null,null,null,null,"5. Select Health Risk Assessments -> Tier II Screening Risk Assessment ->Source Category = Cell B10."]
["Boiler"]
[null,null,null,null,null,null,null,null,null,null,null,null,null,null,null,null,null,"Boiler Rating"]
["Max Burner Rating",null,"MMBtu/hr",null,null,null,null,null,null,null,null,null,null,null,"Toxic NSR Entry",null,null,"<10 mmbtu/hr","10-100 mmbtu/hr",">100 mmbtu/hr"]
["Equipment w/ SNCR, SCR or Other",null,null,null,null,null,null,"Compound*","CAS #","EF (*)","R1","R2","R1","R2","R1 (Uncontrolled)","R2 (Controlled)",null,"EF","EF","EF"]
["Fuel HHV",1050,"Btu/ft³",null,null,null,null,null,null,"(lbs/mmcf)","(lbs/hr)","(lbs/hr)","(lbs/yr)","(lbs/yr)","(E-06 lbs/hr)","(E-06 lbs/hr)",null,"(lbs/mmcf)","(lbs/mmcf)","(lbs/mmcf)"]
["Fuel Rate",{"$f":"(B13*1000000)/B15","v":0},"ft³/hr",null,null,null,null,{"$f":"_xlfn.XLOOKUP(_xlfn.NUMBERVALUE(IFERROR(SUBSTITUTE(SUBSTITUTE(SUBSTITUTE(I16, \"-\", \"\", 1), \"-\", \"\", 1), \"-\", \"\", 1), I16)),TACList!$B:$B,TACList!$A:$A)","v":"Acetaldehyde"},"75-07-0",{"$f":"IF($B$13<10,R16, IF(AND($B$13>=10, $B$13<=100 ),S16, T16))","v":4.3E-3},{"$f":"J16*$B$17","v":0},{"$f":"K16*(1-$B$6)","v":0},{"$f":"K16*$B$3*$B$4*$B$5","v":0},{"$f":"L16*$B$3*$B$4*$B$5","v":0},{"$f":"K16*1000000","v":0},{"$f":"L16*1000000","v":0},null,4.3E-3,3.0999999999999999E-3,8.9999999999999998E-4]
["MMCF Fuel Rate",{"$f":"B16/1000000","v":0},"mmcf/hr",null,null,null,null,{"$f":"_xlfn.XLOOKUP(_xlfn.NUMBERVALUE(IFERROR(SUBSTITUTE(SUBSTITUTE(SUBSTITUTE(I17, \"-\", \"\", 1), \"-\", \"\", 1), \"-\", \"\", 1), I17)),TACList!$B:$B,TACList!$A:$A)","v":"Acrolein"},"107-02-8",2.7000000000000001E-3,0,{"$f":"K17*(1-$B$6)","v":0},{"$f":"K17*$B$3*$B$4*$B$5","v":0},{"$f":"L17*$B$3*$B$4*$B$5","v":0},0,0,null,2.7000000000000001E-3,2.7000000000000001E-3,8.0000000000000004E-4]
[null,null,null,null,null,null,null,{"$f":"_xlfn.XLOOKUP(_xlfn.NUMBERVALUE(IFERROR(SUBSTITUTE(SUBSTITUTE(SUBSTITUTE(I18, \"-\", \"\", 1), \"-\", \"\", 1), \"-\", \"\", 1), I18)),TACList!$B:$B,TACList!$A:$A)","v":"Ammonia"},"7664-41-7",{"$f":"IF($B$13<10,R18, IF(AND($B$13>=10, $B$13<=100 ),S18, T18))","v":{"$error":"#N/A"}},{"$error":"#N/A"},{"$error":"#N/A"},{"$error":"#N/A"},{"$error":"#N/A"},{"$error":"#N/A"},{"$error":"#N/A"},null,{"$f":"VLOOKUP($B$14,$A$20:$B$23,2,FALSE)","v":{"$error":"#N/A"}},{"$f":"VLOOKUP($B$14,$A$20:$B$23,2,FALSE)","v":{"$error":"#N/A"}},{"$f":"VLOOKUP($B$14,$A$20:$B$23,2,FALSE)","v":{"$error":"#N/A"}}]
[null,"Ammonia EF",null,null,null,null,null,{"$f":"_xlfn.XLOOKUP(_xlfn.NUMBERVALUE(IFERROR(SUBSTITUTE(SUBSTITUTE(SUBSTITUTE(I19, \"-\", \"\", 1), \"-\", \"\", 1), \"-\", \"\", 1), I19)),TACList!$B:$B,TACList!$A:$A)","v":"Benzene"},"71-43-2",8.0000000000000002E-3,0,0,0,0,0,0,null,8.0000000000000002E-3,5.7999999999999996E-3,1.6999999999999999E-3]
["CONTROL","(lbs/mmcf)",null,null,null,null,null,{"$f":"_xlfn.XLOOKUP(_xlfn.NUMBERVALUE(IFERROR(SUBSTITUTE(SUBSTITUTE(SUBSTITUTE(I20, \"-\", \"\", 1), \"-\", \"\", 1), \"-\", \"\", 1), I20)),TACList!$B:$B,TACList!$A:$A)","v":"Ethyl benzene"},"100-41-4",9.4999999999999998E-3,0,0,0,0,0,0,null,9.4999999999999998E-3,6.8999999999999999E-3,2E-3]
["SNCR",18,null,null,null,null,null,{"$f":"_xlfn.XLOOKUP(_xlfn.NUMBERVALUE(IFERROR(SUBSTITUTE(SUBSTITUTE(SUBSTITUTE(I21, \"-\", \"\", 1), \"-\", \"\", 1), \"-\", \"\", 1), I21)),TACList!$B:$B,TACList!$A:$A)","v":"Formaldehyde"},"50-00-0",1.7000000000000001E-2,0,0,0,0,0,0,null,1.7000000000000001E-2,1.23E-2,3.5999999999999999E-3]
["SCR",9.1,null,null,null,null,null,{"$f":"_xlfn.XLOOKUP(_xlfn.NUMBERVALUE(IFERROR(SUBSTITUTE(SUBSTITUTE(SUBSTITUTE(I22, \"-\", \"\", 1), \"-\", \"\", 1), \"-\", \"\", 1), I22)),TACList!$B:$B,TACList!$A:$A)","v":"Hexane"},"110-54-3",6.3E-3,0,0,0,0,0,0,null,6.3E-3,4.5999999999999999E-3,1.2999999999999999E-3]
["OTHER",3.2,null,null,null,null,null,{"$f":"_xlfn.XLOOKUP(_xlfn.NUMBERVALUE(IFERROR(SUBSTITUTE(SUBSTITUTE(SUBSTITUTE(I23, \"-\", \"\", 1), \"-\", \"\", 1), \"-\", \"\", 1), I23)),TACList!$B:$B,TACList!$A:$A)","v":"PAHs, total, w/o individ. components reported [Treated as B(a)P for HRA]"},1151,1E-4,0,0,0,0,0,0,null,1E-4,1E-4,1E-4]
["Note:  Select \"OTHER\" when there is no control or when the control type is not SNCR or SCR.",null,null,null,null,null,null,{"$f":"_xlfn.XLOOKUP(_xlfn.NUMBERVALUE(IFERROR(SUBSTITUTE(SUBSTITUTE(SUBSTITUTE(I24, \"-\", \"\", 1), \"-\", \"\", 1), \"-\", \"\", 1), I24)),TACList!$B:$B,TACList!$A:$A)","v":"Naphthalene"},"91-20-3",2.9999999999999997E-4,0,0,0,0,0,0,null,2.9999999999999997E-4,2.9999999999999997E-4,2.9999999999999997E-4]
[null,null,null,null,null,null,null,{"$f":"_xlfn.XLOOKUP(_xlfn.NUMBERVALUE(IFERROR(SUBSTITUTE(SUBSTITUTE(SUBSTITUTE(I25, \"-\", \"\", 1), \"-\", \"\", 1), \"-\", \"\", 1), I25)),TACList!$B:$B,TACList!$A:$A)","v":"Toluene"},"108-88-3",3.6600000000000001E-2,0,0,0,0,0,0,null,3.6600000000000001E-2,2.6499999999999999E-2,7.7999999999999996E-3]
[null,null,null,null,null,null,null,{"$f":"_xlfn.XLOOKUP(_xlfn.NUMBERVALUE(IFERROR(SUBSTITUTE(SUBSTITUTE(SUBSTITUTE(I26, \"-\", \"\", 1), \"-\", \"\", 1), \"-\", \"\", 1), I26)),TACList!$B:$B,TACList!$A:$A)","v":"Xylenes (mixed)"},"1330-20-7",2.7199999999999998E-2,0,0,0,0,0,0,null,2.7199999999999998E-2,1.9699999999999999E-2,5.7999999999999996E-3]
[null,null,null,null,null,null,null,null,null,null,null,null,null,null,null,null,null,"*Data from AB2588 Reporting Procedure - Dec 2014"]
[]
["Crematories"]
[]
["Crematory Type (Human or Animal)",null,null,null,null,null,null,null,null,null,null,null,null,null,"Toxic NSR Entry",null,null,"Human Cremation","Animal Cremation"]
["Maximum Burn Rate",null,"lbs/hr",null,null,null,null,"Compound*","CAS #","EF (*)","R1","R2","R1","R2","R1 (Uncontrolled)","R2 (Controlled)",null,"EF","EF"]
["Combustion Control Efficiency",{"$f":"$B$6","v":0},"value between 0-1",null,null,null,null,null,null,"(lbs/ton)","(lbs/hr)","(lbs/hr)","(lbs/yr)","(lbs/yr)","(E-06 lbs/hr)","(E-06 lbs/hr)",null,"(lbs/ton)","(lbs/ton)"]
[null,null,null,null,null,null,null,{"$f":"_xlfn.XLOOKUP(_xlfn.NUMBERVALUE(IFERROR(SUBSTITUTE(SUBSTITUTE(SUBSTITUTE(I34, \"-\", \"\", 1), \"-\", \"\", 1), \"-\", \"\", 1), I34)),TACList!$B:$B,TACList!$A:$A)","v":"Acetaldehyde"},75070,{"$f":"IF(B$31=\"Human Cremation\",R34,S34)","v":1.5E-3},{"$f":"J34*$B$32/2000","v":0},{"$f":"K34*(1-$B$6)","v":0},{"$f":"K34*$B$3*$B$4*$B$5","v":0},{"$f":"L34*$B$3*$B$4*$B$5","v":0},{"$f":"K34*1000000","v":0},{"$f":"L34*1000000","v":0},null,1.5E-3,1.5E-3]
[null,null,null,null,null,null,null,{"$f":"_xlfn.XLOOKUP(_xlfn.NUMBERVALUE(IFERROR(SUBSTITUTE(SUBSTITUTE(SUBSTITUTE(I35, \"-\", \"\", 1), \"-\", \"\", 1), \"-\", \"\", 1), I35)),TACList!$B:$B,TACList!$A:$A)","v":"Arsenic"},"7440-38-2",{"$f":"IF(B$31=\"Human Cremation\",R35,S35)","v":5.8E-4},0,{"$f":"K35*(1-$B$6)","v":0},{"$f":"K35*$B$3*$B$4*$B$5","v":0},{"$f":"L35*$B$3*$B$4*$B$5","v":0},{"$f":"K35*1000000","v":0},{"$f":"L35*1000000","v":0},null,5.8E-4,5.8E-4]
[null,null,null,null,null,null,null,{"$f":"_xlfn.XLOOKUP(_xlfn.NUMBERVALUE(IFERROR(SUBSTITUTE(SUBSTITUTE(SUBSTITUTE(I36, \"-\", \"\", 1), \"-\", \"\", 1), \"-\", \"\", 1), I36)),TACList!$B:$B,TACList!$A:$A)","v":"Benzene"},71432,7.2000000000000005E-4,0,0,0,0,0,0,null,7.2000000000000005E-4,7.2000000000000005E-4]
[null,null,null,null,null,null,null,{"$f":"_xlfn.XLOOKUP(_xlfn.NUMBERVALUE(IFERROR(SUBSTITUTE(SUBSTITUTE(SUBSTITUTE(I37, \"-\", \"\", 1), \"-\", \"\", 1), \"-\", \"\", 1), I37)),TACList!$B:$B,TACList!$A:$A)","v":"Beryllium"},"7440-41-7",2.0000000000000002E-5,0,0,0,0,0,0,null,2.0000000000000002E-5,2.0000000000000002E-5]
[null,null,null,null,null,null,null,{"$f":"_xlfn.XLOOKUP(_xlfn.NUMBERVALUE(IFERROR(SUBSTITUTE(SUBSTITUTE(SUBSTITUTE(I38, \"-\", \"\", 1), \"-\", \"\", 1), \"-\", \"\", 1), I38)),TACList!$B:$B,TACList!$A:$A)","v":"Cadmium"},"7440-43-9",1.6000000000000001E-4,0,0,0,0,0,0,null,1.6000000000000001E-4,1.6000000000000001E-4]
[null,null,null,null,null,null,null,{"$f":"_xlfn.XLOOKUP(_xlfn.NUMBERVALUE(IFERROR(SUBSTITUTE(SUBSTITUTE(SUBSTITUTE(I39, \"-\", \"\", 1), \"-\", \"\", 1), \"-\", \"\", 1), I39)),TACList!$B:$B,TACList!$A:$A)","v":"Chromium, hexavalent (& compounds)"},"18540-29-9",1.9000000000000001E-4,0,0,0,0,0,0,null,1.9000000000000001E-4,1.9000000000000001E-4]
[null,null,null,null,null,null,null,{"$f":"_xlfn.XLOOKUP(_xlfn.NUMBERVALUE(IFERROR(SUBSTITUTE(SUBSTITUTE(SUBSTITUTE(I40, \"-\", \"\", 1), \"-\", \"\", 1), \"-\", \"\", 1), I40)),TACList!$B:$B,TACList!$A:$A)","v":"Copper"},7440508,4.0000000000000002E-4,0,0,0,0,0,0,null,4.0000000000000002E-4,4.0000000000000002E-4]
{"$rows_left_out":251}
{"sheet":"TACList","index":1,"n_rows":315,"n_cols":2,"rows_kept":315,"cut":false,"hidden":false,"merged":[]}
["Toxic Air Contaminant","CAS No."]
["[D] Cyanide compounds [Deleted/Obsolete Emittent ID]",1073]
["1,1,2,2-Tetrachloroethane",79345]
["1,1,2-Trichloroethane",79005]
["1,1-Dichloroethane",75343]
["1,2,3,4,6,7,8,9-Octachlorodibenzofuran",39001020]
["1,2,3,4,6,7,8,9-Octachlorodibenzo-p-dioxin",3268879]
["1,2,3,4,6,7,8-Heptachlorodibenzofuran",67562394]
["1,2,3,4,6,7,8-Heptachlorodibenzo-p-dioxin",35822469]
["1,2,3,4,7,8,9-Heptachlorodibenzofuran",55673897]
["1,2,3,4,7,8-Hexachlorodibenzofuran",70648269]
["1,2,3,4,7,8-Hexachlorodibenzo-p-dioxin",39227286]
["1,2,3,6,7,8-Hexachlorodibenzofuran",57117449]
["1,2,3,6,7,8-Hexachlorodibenzo-p-dioxin",57653857]
["1,2,3,7,8,9-Hexachlorodibenzofuran",72918219]
["1,2,3,7,8,9-Hexachlorodibenzo-p-dioxin",19408743]
["1,2,3,7,8-Pentachlorodibenzofuran",57117416]
["1,2,3,7,8-Pentachlorodibenzo-p-dioxin",40321764]
["1,2,3-Trimethylbenzene",526738]
["1,2,4-Trimethylbenzene",95636]
["1,2-Dibromo-3-chloropropane",96128]
["1,2-Epoxybutane",106887]
["1,3,5-Trimethylbenzene",108678]
["1,3-Butadiene",106990]
["1,3-Propane sultone",1120714]
["1,4-Dioxane",123911]
["1,6-Dinitropyrene",42397648]
["1,8-Dinitropyrene",42397659]
["1-Chloro-4-(trifluoromethyl)benzene [PCBTF]",98566]
["1-Nitropyrene",5522430]
["1-n-Propyl Bromide {1-1-n-Propyl Bromide {1-Bromopropane}",106945]
["2,3,3',4,4',5,5'-Heptachlorobiphenyl {PCB 189}",39635319]
["2,3,3',4,4',5-Hexachlorobiphenyl {PCB 156}",38380084]
["2,3,3',4,4',5'-Hexachlorobiphenyl {PCB 157}",69782907]
["2,3,3',4,4'-Pentachlorobiphenyl {PCB 105}",32598144]
["2,3',4,4',5,5'-Hexachlorobiphenyl {PCB 167}",52663726]
["2,3',4,4',5-Pentachlorobiphenyl",31508006]
["2,3,4,4',5-Pentachlorobiphenyl {PCB 114}",74472370]
["2,3',4,4',5'-Pentachlorobiphenyl {PCB 123}",65510443]
["2,3,4,6,7,8-Hexachlorodibenzofuran",60851345]
{"$rows_left_out":276}
{"sheet":"Emissions Output","index":2,"n_rows":0,"n_cols":0,"rows_kept":0,"cut":false,"hidden":false,"merged":[]}

{"sheet":"Concentrations for Tier 3","index":3,"n_rows":315,"n_cols":6,"rows_kept":315,"cut":false,"hidden":false,"merged":[]}
["TAC","CAS","Receptor ID","Hourly max Concentration at receptor, ug/m3","8hr mean Concentration at receptor, ug/m3","Annual mean Concentration at receptor, ug/m3"]
["Arsenic compounds (inorganic)",1016]
["Benzidine-based dyes",1020]
["[D] Cyanide compounds [Deleted/Obsolete Emittent ID]",1073]
["Dibenzofurans (chlorinated) {PCDFs} [Treated as 2378TCDD for HRA]",1080]
["Dioxins, total, w/o individ. isomers reported {PCDDs} [Treat as 2378TCDD for HRA",1086]
["Fluorides and compounds",1101]
["Lead compounds (inorganic)",1128]
["Modified Hydrogen fluoride {MHF}",1141]
["Nickel refinery dust from the pyrometallurgical process",1146]
["PAHs, total, w/o individ. components reported [Treated as B(a)P for HRA]",1151]
["Silica, crystalline (respirable)",1175]
["Cobalt compounds, insoluble",1216]
["Cobalt sulfate and other soluble cobalt compounds",1217]
["Polymeric (Oligo) HDI",1221]
["Diisocyanurate",1226]
["HDI Prepolymer",1227]
["Isocyanurate",1228]
["Polybrominated diphenyl ethers {PBDEs}",2222]
["Diesel engine exhaust, particulate matter (Diesel PM)",9901]
["SULFATES",9960]
["Formaldehyde",50000]
["Benzo[a]pyrene",50328]
["Urethane",51796]
["Dibenz[a,h]anthracene",53703]
["N-Nitrosodiethylamine",55185]
["Carbon tetrachloride",56235]
["3-Methylcholanthrene",56495]
["Benz[a]anthracene",56553]
["Cyanide compounds (inorganic)",57125]
["7,12-Dimethylbenz[a]anthracene",57976]
["Lindane {gamma-Hexachlorocyclohexane}",58899]
["N-Nitrosomorpholine",59892]
["4-Dimethylaminoazobenzene",60117]
["Acetamide",60355]
["Aniline",62533]
["Thioacetamide",62555]
["N-Nitrosodimethylamine",62759]
["Methanol",67561]
["Isopropyl alcohol",67630]
{"$rows_left_out":276}
{"sheet":"Instructions for Conc. for T3","index":4,"n_rows":47,"n_cols":9,"rows_kept":47,"cut":false,"hidden":false,"merged":[[40,0,42,0],[26,7,28,7],[26,8,28,8],[29,0,31,0],[37,3,39,3],[37,4,39,4],[37,5,39,5],[37,6,39,6],[37,7,39,7],[37,8,39,8],[26,3,28,3],[26,4,28,4],[26,5,28,5],[26,6,28,6]]}
["Instructions on Using Concentrations for Tier 3 Spreadsheet"]
["The sheet \"Concentrations for Tier 3\" can be used to upload onto the HRA Web Tool large numbers of Toxic Air Contaminants, receptors, and the hourly max concentration, 8hr mean concentration and annual mean concentration at the receptor without having to enter each of them in one at a time."]
[]
["Note: The HRA Web Tool looks specifically for specific names on the TAC List and the specific CAS Number (containing no hyphens.) It is important to use only the TAC List names and CAS Numbers provided on the list."]
[]
["Scenario 1: 1 TAC at 1 Receptor"]
[]
["1.  The total # of rows required for a successful import is (# of Receptors) multiplied by (# of TACs) For 1 TAC at 1 Receptor, you will need 1*1 = 1 Row. Locate the row for the TAC you want to enter emissions for. For this example, we will use Arsenic compounds (inorganic), CAS 1016.",null,null,"TAC","CAS","Receptor ID","Hourly max Concentration at receptor, ug/m3","8hr mean Concentration at receptor, ug/m3","Annual mean Concentration at receptor, ug/m3"]
[null,null,2,"Arsenic compounds (inorganic)",1016,"Person 1",2.837998501184219E-7,6.907154558480377E-7,8.4394487235949975E-7]
["2. Type in the Receptor ID, if it is a Worker Receptor, make sure the label of the name has \"work\" in it.",null,3,"Benzidine-based dyes",1020]
[null,null,4,"[D] Cyanide compounds [Deleted/Obsolete Emittent ID]",1073]
["3. Type in the Hourly, 8hr Mean, Annual Mean concentrations at the receptor.",null,5,"Dibenzofurans (chlorinated) {PCDFs} [Treated as 2378TCDD for HRA]",1080]
[null,null,6,"Dioxins, total, w/o individ. isomers reported {PCDDs} [Treat as 2378TCDD for HRA",1086]
["4. Close the file and then import it into the Tier 3 section of the Health Risk Assessment Web Tool.",null,7,"Fluorides and compounds",1101]
[null,null,8,"Lead compounds (inorganic)",1128]
[]
["Scenario 2: 1 TAC at 3 Receptors"]
["1.  The total # of rows required for a successful import is (# of Receptors) multiplied by (# of TACs) For 1 TAC at 1 Receptor, you will need 3*1 = 3 Rows. Locate the row for the TAC you want to enter emissions for. For this example, we will use Arsenic compounds (inorganic), CAS 1016.",null,null,"TAC","CAS","Receptor ID","Hourly max Concentration at receptor, ug/m3","8hr mean Concentration at receptor, ug/m3","Annual mean Concentration at receptor, ug/m3"]
[null,null,2,"Arsenic compounds (inorganic)",1016]
["2. Once you have found the row, select the row number to highlight the whole row.",null,3,"Benzidine-based dyes",1020]
[null,null,4,"[D] Cyanide compounds [Deleted/Obsolete Emittent ID]",1073]
["3. Right-Click, Copy. (You can also use Ctrl+V.)",null,5,"Dibenzofurans (chlorinated) {PCDFs} [Treated as 2378TCDD for HRA]",1080]
[null,null,6,"Dioxins, total, w/o individ. isomers reported {PCDDs} [Treat as 2378TCDD for HRA",1086]
["4. Right-Click on the Row you highlighted. Click Insert Copied Rows from the dropdown.",null,7,"Fluorides and compounds",1101]
[null,null,8,"Lead compounds (inorganic)",1128]
[]
[null,null,null,"TAC","CAS","Receptor ID","Hourly max Concentration at receptor, ug/m3","8hr mean Concentration at receptor, ug/m3","Annual mean Concentration at receptor, ug/m3"]
[]
[]
["5. Here is an example of what it looks like after the row is inserted. Because we need 1 of the TAC for each of the receptors, repease Step 2-4 one more time to get a total of 3 rows that show Arsenic compounds (inorganic), CAS 1016.",null,2,"Arsenic compounds (inorganic)",1016]
[null,null,3,"Arsenic compounds (inorganic)",1016]
[null,null,4,"Benzidine-based dyes",1020]
[null,null,5,"[D] Cyanide compounds [Deleted/Obsolete Emittent ID]",1073]
[null,null,6,"Dibenzofurans (chlorinated) {PCDFs} [Treated as 2378TCDD for HRA]",1080]
[null,null,7,"Dioxins, total, w/o individ. isomers reported {PCDDs} [Treat as 2378TCDD for HRA",1086]
[null,null,8,"Fluorides and compounds",1101]
[]
[null,null,null,"TAC","CAS","Receptor ID","Hourly max Concentration at receptor, ug/m3","8hr mean Concentration at receptor, ug/m3","Annual mean Concentration at receptor, ug/m3"]
[]
[]
{"$rows_left_out":8}
{"sheet":"Revision History","index":5,"n_rows":29,"n_cols":3,"rows_kept":29,"cut":false,"hidden":false,"merged":[]}
["Risk Tool Release Notes",null,"For Further Questions, please contact:"]
[null,null,"Luke Lau\nAir Quality Engineer II\nEmail: llau@aqmd.gov"]
[]
["Emission Estimator for HIA V1.01 Jul 2024",null,"2024-07-01"]
["1. Initial Version"]
[]
["Emissions Calculator for HRA Tool V02",null,"2024-09-01"]
["1. Changed references from Sheet1 to Emissions Estimator in VBA script to resolve Out of Range error from renamed sheet."]
["2. Added all items from the HRA Web Tool dropdown with either linking them to similarly named equipment or with a message saying they have to manually enter in the information."]
[]
["Emissions Calculator for HRA Tool V03",null,"2024-10-23"]
["1. Switched CAS Number and Compound Name heading titles for A136 and B136 for Spray Booth and A182 and B182 in the \"Other\" Module."]
["2. Added a placeholder row to distinguish between combustion TAC emissions and TAC emissions from coating materials."]
["3. Headers have been corrected and extraneous and repetitive headers have been removed."]
["4. TACs for Spray Booth increased to 50."]
["5. Added disclaimer that the Spray Booth module only calculates Natural Gas Combustion emissions and that propane uses different ones."]
["4. Added a disclaimer that combustion emissions are calculated using the maximum operating schedule of 24/7/52 but added an option to impose a permit limt that will calculate off of that if selected by the engineer."]
["5. When selection Spray Booth or Other, the row above for Control Efficiency is hidden because it will use the in-module control efficiencies."]
["6. Added light yellow shading and table borders for Concentrations of Tier 3 sheet."]
["7. Added instructions for Concentrations for Tier 3 sheet with examples and Excel simulated screenshots."]
["8. Spray Booth and Other Module changed from \"Toxic Not Found, Please Remove\" to \"Compound Not Found, Please Remove\" when the CAS Number does not match up to something on the list."]
["9. Added a disclaimer for Spray Booth and Other Module that mentions some compounds may not be explicitly listed in the tool but are still subject to Rule 1401."]
[]
["Emissions Calculator for HRA Tool V03.01",null,"2024-10-25"]
["1. Switched CAS Number and Compound Name heading titles for A136 and B136 for Spray Booth and A182 and B182 in the \"Other\" Module."]
[]
["Emissions Calculator for HRA Tool V03.02",null,"2024-11-01"]
["1. Change Cell J33 to \"lbs/ton\" to correct emission factor."]
["2. Added \"Refresh\" on Save Function to ensure that values are correctly moved the Emissions Output file."]

{"sheet":"Reference","index":6,"n_rows":21,"n_cols":4,"rows_kept":21,"cut":false,"hidden":true,"merged":[]}
["Equipment Type","Source","Point To","Notes"]
[]
["Boiler","Old 1401 Spreadsheet","CopyBoiler"]
["Crematories","Jillian's List","CopyCrematory"]
["Diesel ICE","Old 1401 Spreadsheet","CopyDieselICE"]
["Diesel Pressure Washer","Old 1401 Spreadsheet","CopyDieselPressureWasher"]
["Diesel Reciprocating Internal Combustion Engines","Jillian's List","CopyDieselICE"]
["Ethanol 85 Underground Storage Tanks","Jillian's List","TAC emissions built into Tool"]
["Gaseous Fueled Fired (Natural Gas) Boilers","Jillian's List","CopyBoiler"]
["Gasoline Aboveground Storage Tanks","Jillian's List","TAC emissions built into Tool"]
["Gasoline Underground Storage Tanks","Jillian's List","TAC emissions built into Tool"]
["General Non-Combustion Point Source","Jillian's List","Not Supported by Tool"]
["General Non-Combustion Volume Source","Jillian's List","Not Supported by Tool"]
["Lean Burn ICE","Old 1401 Spreadsheet","CopyLeanICE"]
["Mobile Fuelers","Jillian's List","TAC emissions built into Tool"]
["Natural Gas Reciprocating Internal Combustion Engines","Jillian's List","CopyLeanICE"]
["Rich Burn ICE","Old 1401 Spreadsheet","CopyRichICE"]
["Spray Booth","Old 1401 Spreadsheet","CopySprayBooth"]
["Other","Addition","CopyOther"]
["Crematory","Old 1401 Spreadsheet","CopyCrematory","Duplicate"]
["Spray Booth","Jillian's List","CopySprayBooth","Duplicate"]